{"text_format":"1","workbook":"xlsx","n_sheets":10,"sheets":["Instructions","Buses TCO Dashboard","Summary","Currency","Capital Cost","Operational Cost","Financing","TCO_1","Plots","References"],"not_rendered":{"charts":10,"images":13,"macros":0,"external_links":1,"defined_names":0,"comments":0,"pivot_tables":0},"unopened":[],"bounds":{"document_bytes":16777216,"sheet_cells":100000,"rows_first":2000,"rows_last":500,"rows_between":2000,"halvings":0,"cell_chars":16384,"cell_head_chars":4096},"cells_cut":0,"cells_raw":0,"read":"whole","date_system":"1900"}

{"sheet":"Instructions","index":0,"n_rows":44,"n_cols":6,"rows_kept":44,"cut":false,"hidden":false,"merged":[[35,1,35,3],[35,5,35,13],[22,1,22,13],[33,1,33,3],[33,5,33,13],[34,1,34,3],[34,5,34,13],[23,1,23,3],[23,5,23,13],[30,1,30,3],[30,5,30,13],[31,1,31,3],[31,5,31,13],[1,1,1,13],[3,1,3,13],[26,5,26,13],[29,5,29,13],[12,1,12,3],[11,5,13,13],[15,5,15,13],[16,5,16,13],[17,5,17,13],[20,1,20,3],[20,5,20,13],[21,1,21,3],[21,5,21,13],[32,5,32,13],[5,1,5,8],[8,1,8,3],[9,1,9,3],[10,1,10,3],[9,5,9,13],[8,5,8,13],[10,5,10,13],[27,1,27,3],[27,5,27,13],[14,1,14,13],[15,1,15,3],[16,1,16,3],[11,1,11,3],[43,1,44,14],[29,1,29,3],[17,1,17,3],[18,1,18,3],[24,1,24,3],[25,1,25,3],[26,1,26,3],[18,5,18,13],[24,5,24,13],[25,5,25,13],[36,5,36,13],[32,1,32,3],[36,1,36,3],[28,1,28,13],[19,1,19,3],[19,5,19,13]]}
[]
[null,"HOW TO USE THE DYNAMIC TOTAL COST OF OWNERSHIP DASHBOARD"]
[]
[null,"All cells highlighted Green are Input cells. Values can only be edited in these cells to observe the dynamic changes in the dashboard on the right."]
[]
[null,"All cells highlighted Gray are Fixed cells. These values cannot be edited."]
[]
[]
[null,"CELL NAME",null,null,"FUNCTION","ACTION REQUIRED"]
[null,"Vehicle Holding Period (Year)",null,null,"Editable","Use the drop down menu on Cell C5 to choose the Vehicle holding period from 1 to 10 years "]
[null,"Daily Distance Travelled (km)",null,null,"Editable","Use the arrows on the right to increase/decrease to input Daily Distance Travelled in km"]
[null,"Daily Distance Travelled (mi)",null,null,"Fixed"]
[null,"Annual Distance Travelled (km)",null,null,"Fixed"]
[null,"Annual Distance Travelled (mi)",null,null,"Fixed"]
[]
{"$rows_left_out":30}
{"sheet":"Buses TCO Dashboard","index":1,"n_rows":61,"n_cols":48,"rows_kept":61,"cut":false,"hidden":false,"merged":[[2,1,2,3],[14,3,14,5],[16,2,16,5],[4,3,4,5]]}
[null,null,null,null,null,null,null,null,null,null,null,null,null,null,null,null,null,null,null,null,null,null,null,null,null,null,null,null,null,null,null,null,null,null,null,null,"10 YEAR","TCO",null,null,null,null,null,"DYNAMIC","TCO"]
[null,null,null,null,null,null,null,null,null,null,null,null,null,null,null,null,null,null,null,null,null,null,null,null,null,null,null,null,null,null,null,null,null,null,null,null,"e-Bus",{"$f":"TCO_1!C11","v":33.046914149071881},null,null,null,null,null,"e-Bus",{"$f":"VLOOKUP($C$5,$AR$10:$AV$20,2,0)","v":46.615483418428887}]
[null,null,null,null,null,null,null,null,null,null,null,null,null,null,null,null,null,null,null,null,null,null,null,null,null,null,null,null,null,null,null,null,null,null,null,null,"D-Bus (HC)",{"$f":"TCO_1!D11","v":54.446624675727328},null,null,null,null,null,"D - Bus (HC)",{"$f":"VLOOKUP($C$5,$AR$10:$AV$20,3,0)","v":74.830206007372354}]
[null,null,null,null,null,null,null,null,null,null,null,null,null,null,null,null,null,null,null,null,null,null,null,null,null,null,null,null,null,null,null,null,null,null,null,null,"D-Bus (LC)",{"$f":"TCO_1!E11","v":33.468314884995642},null,null,null,null,null,"D - Bus (LC)",{"$f":"VLOOKUP($C$5,$AR$10:$AV$20,4,0)","v":46.667708819497946}]
[null,"Vehicle Holding Period (Year)",5,"              Use Drop down to choose Holding Period",null,null,null,null,null,null,null,null,null,null,null,null,null,null,null,null,null,null,null,null,null,null,null,null,null,null,null,null,null,null,null,null,"CNG - Bus",{"$f":"TCO_1!F11","v":31.991918239629442},null,null,null,null,null,"CNG - Bus",{"$f":"VLOOKUP($C$5,$AR$10:$AV$20,5,0)","v":44.690625326453585}]
[]
[null,"Daily Distance Travelled (km)",250,null,"(Use Arrows to input Distance)"]
[null,"Daily Distance Travelled (mi)",{"$f":"C7*0.621371","v":155.34275}]
[]
[null,"Annual Distance Travelled (km)",{"$f":"C7*365","v":91250},null,null,null,null,null,null,null,null,null,null,null,null,null,null,null,null,null,null,null,null,null,null,null,null,null,null,null,null,null,null,null,null,null,"Operational Years","e-Bus","D - Bus (HC)","D - Bus (LC)","CNG - Bus",null,null,null,"e-Bus","D - Bus (HC)","D - Bus (LC)","CNG - Bus"]
[null,"Annual Distance Travelled (mi)",{"$f":"C8*365","v":56700.103749999995},null,null,null,null,null,null,null,null,null,null,null,null,null,null,null,null,null,null,null,null,null,null,null,null,null,null,null,null,null,null,null,null,null,"Year 1",{"$f":"TCO_1!C31","v":139.57009326435306},{"$f":"TCO_1!C34","v":188.72163809792195},{"$f":"TCO_1!C37","v":125.47473860245393},{"$f":"TCO_1!C40","v":121.09311136224441},null,null,1,{"$f":"IF($C$5=AR11,AL11:AO11,)","v":0}]
[null,null,null,null,null,null,null,null,null,null,null,null,null,null,null,null,null,null,null,null,null,null,null,null,null,null,null,null,null,null,null,null,null,null,null,null,"Year 2",{"$f":"TCO_1!D31","v":82.332689889469961},{"$f":"TCO_1!D34","v":120.18688762077429},{"$f":"TCO_1!D37","v":77.66827555706071},{"$f":"TCO_1!D40","v":74.703755684189986},null,null,2,{"$f":"IF($C$5=AR12,AL12:AO12,)","v":0}]
[null,null,null,null,null,null,null,null,null,null,null,null,null,null,null,null,null,null,null,null,null,null,null,null,null,null,null,null,null,null,null,null,null,null,null,null,"Year 3",{"$f":"TCO_1!E31","v":62.844254257976679},{"$f":"TCO_1!E34","v":96.087302149310744},{"$f":"TCO_1!E37","v":61.045959380666503},{"$f":"TCO_1!E40","v":58.594391524822846},null,null,3,{"$f":"IF($C$5=AR13,AL13:AO13,)","v":0}]
[null,null,null,null,null,null,null,null,null,null,null,null,null,null,null,null,null,null,null,null,null,null,null,null,null,null,null,null,null,null,null,null,null,null,null,null,"Year 4",{"$f":"TCO_1!F31","v":52.82465172247295},{"$f":"TCO_1!F34","v":83.186382795637826},{"$f":"TCO_1!F37","v":52.269549271950822},{"$f":"TCO_1!F40","v":50.102039636077443},null,null,4,{"$f":"IF($C$5=AR14,AL14:AO14,)","v":0}]
[null,null,"INR",null,null,null,null,null,null,null,null,null,null,null,null,null,null,null,null,null,null,null,null,null,null,null,null,null,null,null,null,null,null,null,null,null,"Year 5",{"$f":"TCO_1!G31","v":46.615483418428887},{"$f":"TCO_1!G34","v":74.830206007372354},{"$f":"TCO_1!G37","v":46.667708819497946},{"$f":"TCO_1!G40","v":44.690625326453585},null,null,5,{"$f":"IF($C$5=AR15,AL15:AO15,)","v":46.615483418428887},74.830206007372354,46.667708819497946,44.690625326453585]
{"$rows_left_out":47}
{"sheet":"Summary","index":2,"n_rows":30,"n_cols":5,"rows_kept":30,"cut":false,"hidden":false,"merged":[[0,0,0,1],[11,0,11,4],[19,0,19,4],[27,0,27,4]]}
["TRAVEL DETAILS"]
["Number of Vehicle",1]
["Life of Vehicle (yrs)",10]
["Annual drive distance (KM)",{"$f":"'Buses TCO Dashboard'!C10","v":91250}]
["Total Distance Travel (KM)",{"$f":"B3*B4","v":912500}]
["LIB Cost (USD/kWh)",{"$f":"'Buses TCO Dashboard'!C40","v":137}]
["USD to INR",73]
["VRLA Cost (USD/kWh)",100]
["General Inputs","e-Bus (AC)","Diesel-HC Bus (AC)","Diesel-LC Bus (AC)","CNG-Bus (AC)"]
["Discount rate (%)",{"$f":"'Buses TCO Dashboard'!C25","v":0.1},{"$f":"'Buses TCO Dashboard'!D25","v":0.1},{"$f":"'Buses TCO Dashboard'!E25","v":0.1},{"$f":"'Buses TCO Dashboard'!F25","v":0.1}]
["Resale rate (%)",{"$f":"'Buses TCO Dashboard'!C26","v":0.2},{"$f":"'Buses TCO Dashboard'!D26","v":0.1},{"$f":"'Buses TCO Dashboard'!E26","v":0.1},{"$f":"'Buses TCO Dashboard'!F26","v":0.1}]
[]
["Capital Cost","e-Bus (AC)","Diesel-HC Bus (AC)","Diesel-LC Bus (AC)","CNG-Bus (AC)"]
["Total Vehicle Cost (₹)",{"$f":"'Capital Cost'!B8","v":18546277.284251966},{"$f":"'Capital Cost'!C8","v":12843576.749162659},{"$f":"'Capital Cost'!D8","v":9019105.6808394976},{"$f":"'Capital Cost'!E8","v":8758204.2040126026}]
["Resale Value (₹)",{"$f":"B14*B11","v":3709255.4568503932},{"$f":"C14*C11","v":1284357.674916266},{"$f":"D14*D11","v":901910.56808394985},{"$f":"E14*E11","v":875820.42040126026}]
{"$rows_left_out":16}
{"sheet":"Currency","index":3,"n_rows":55,"n_cols":12,"rows_kept":55,"cut":false,"hidden":true,"merged":[[1,1,1,3],[15,1,15,2],[15,4,15,5],[15,7,15,8],[15,10,15,11]]}
[]
[null,"CURRENCY CONVERSION"]
[]
[null,"USD","INR","Conversion"]
[null,1,74,{"$f":"B5*C5","v":74}]
[]
[null,"EURO","INR","Conversion"]
[null,1,82,{"$f":"B8*C8","v":82}]
[]
[]
[]
[]
[]
[]
[]
{"$rows_left_out":41}
{"sheet":"Capital Cost","index":4,"n_rows":42,"n_cols":5,"rows_kept":42,"cut":false,"hidden":true,"merged":[[48,0,48,4],[23,0,23,4],[28,0,28,4],[33,0,33,4],[38,0,38,4],[43,0,43,4]]}
["Vehicle Cost","e-Bus (AC)","Diesel-HC Bus (AC)","Diesel-LC Bus (AC)","CNG-Bus (AC)"]
["Purchase Cost (₹)",{"$f":"VLOOKUP('Buses TCO Dashboard'!$C$15,'Capital Cost'!$A$25:$E$27,2,0)","v":15000000},{"$f":"VLOOKUP('Buses TCO Dashboard'!$C$15,'Capital Cost'!$A$25:$E$27,3,0)","v":8800000},{"$f":"VLOOKUP('Buses TCO Dashboard'!$C$15,'Capital Cost'!$A$25:$E$27,4,0)","v":5807000},{"$f":"VLOOKUP('Buses TCO Dashboard'!$C$15,'Capital Cost'!$A$25:$E$27,5,0)","v":5600000}]
["Tax (₹)",{"$f":"VLOOKUP('Buses TCO Dashboard'!$C$15,'Capital Cost'!$A$30:$E$32,2,0)","v":0},{"$f":"VLOOKUP('Buses TCO Dashboard'!$C$15,'Capital Cost'!$A$30:$E$32,3,0)","v":1752113},{"$f":"VLOOKUP('Buses TCO Dashboard'!$C$15,'Capital Cost'!$A$30:$E$32,4,0)","v":1700000},{"$f":"VLOOKUP('Buses TCO Dashboard'!$C$15,'Capital Cost'!$A$30:$E$32,5,0)","v":1700000}]
["Insurance (₹)",{"$f":"VLOOKUP('Buses TCO Dashboard'!$C$15,'Capital Cost'!$A$35:$E$37,2,0)","v":0},{"$f":"VLOOKUP('Buses TCO Dashboard'!$C$15,'Capital Cost'!$A$35:$E$37,3,0)","v":79200},{"$f":"VLOOKUP('Buses TCO Dashboard'!$C$15,'Capital Cost'!$A$35:$E$37,4,0)","v":52263},{"$f":"VLOOKUP('Buses TCO Dashboard'!$C$15,'Capital Cost'!$A$35:$E$37,5,0)","v":50400}]
["Financing Component (₹)",{"$f":"Financing!B17","v":3546277.2842519656},{"$f":"Financing!C17","v":2212263.749162659},{"$f":"Financing!D17","v":1459842.6808394967},{"$f":"Financing!E17","v":1407804.2040126016}]
["Total Financial Incentive (₹)",0,0,0,0]
["Misc. Cost (₹)",0,0,0,0]
["Total Vehicle Cost (₹)",{"$f":"((B2+B3+B4+B5+B7)-B6)","v":18546277.284251966},{"$f":"((C2+C3+C4+C5+C7)-C6)","v":12843576.749162659},{"$f":"((D2+D3+D4+D5+D7)-D6)","v":9019105.6808394976},{"$f":"((E2+E3+E4+E5+E7)-E6)","v":8758204.2040126026}]
[]
["Charging Infrastructure Cost","e-Bus (AC)","Diesel-HC Bus (AC)","Diesel-LC Bus (AC)","CNG-Bus (AC)"]
["No. of Slow Charger (SC)",0,0,0,0]
["Cost of SC per unit (₹)",0,0,0,0]
["Total Cost of SC (₹)",{"$f":"B11*B12","v":0},{"$f":"C11*C12","v":0},{"$f":"D11*D12","v":0},0]
["No. of Fast Charger (FC)",0,0,0,0]
["Cost of FC per unit (₹)",0,0,0,0]
{"$rows_left_out":28}
{"sheet":"Operational Cost","index":5,"n_rows":47,"n_cols":5,"rows_kept":47,"cut":false,"hidden":true,"merged":[[33,0,33,4],[38,0,38,4],[43,0,43,4]]}
["Staff cost","e-Bus (AC)","Diesel-HC Bus (AC)","Diesel-LC Bus (AC)","CNG-Bus (AC)"]
["Staff Cost (₹ / Month)",{"$f":"VLOOKUP('Buses TCO Dashboard'!$C$15,'Operational Cost'!$A$35:$B$37,2,0)","v":50000},{"$f":"VLOOKUP('Buses TCO Dashboard'!$C$15,'Operational Cost'!$A$35:$B$37,2,0)","v":50000},{"$f":"VLOOKUP('Buses TCO Dashboard'!$C$15,'Operational Cost'!$A$35:$B$37,2,0)","v":50000},{"$f":"VLOOKUP('Buses TCO Dashboard'!$C$15,'Operational Cost'!$A$35:$B$37,2,0)","v":50000}]
["Other Support staff cost (₹ / Month)",0,0,0,0]
["Total Annual Staff Cost (₹)",{"$f":"((B2+B3)*12)","v":600000},{"$f":"((C2+C3)*12)","v":600000},600000,600000]
["Per km Staff Cost",{"$f":"B4/Summary!$B$4","v":6.5753424657534243},{"$f":"C4/Summary!$B$4","v":6.5753424657534243},{"$f":"D4/Summary!$B$4","v":6.5753424657534243},{"$f":"E4/Summary!$B$4","v":6.5753424657534243}]
[]
["Average Fuel Cost","e-Bus (AC)","Diesel-HC Bus (AC)","Diesel-LC Bus (AC)","CNG-Bus (AC)"]
["Fuel cost (₹/kWh; ₹/L)",{"$f":"VLOOKUP('Buses TCO Dashboard'!$C$15,'Operational Cost'!$A$45:$E$47,2,0)","v":6},{"$f":"VLOOKUP('Buses TCO Dashboard'!$C$15,'Operational Cost'!$A$45:$E$47,3,0)","v":88},{"$f":"VLOOKUP('Buses TCO Dashboard'!$C$15,'Operational Cost'!$A$45:$E$47,4,0)","v":88},{"$f":"VLOOKUP('Buses TCO Dashboard'!$C$15,'Operational Cost'!$A$45:$E$47,5,0)","v":47}]
["Mileage (km/kWh; km/L)",{"$f":"'Buses TCO Dashboard'!C46","v":1},{"$f":"'Buses TCO Dashboard'!D46","v":2.2000000000000002},{"$f":"'Buses TCO Dashboard'!E46","v":4.7},{"$f":"'Buses TCO Dashboard'!F46","v":2.8}]
["Annual fuel consumption (kWh; L)",{"$f":"Summary!B4/B9","v":91250},{"$f":"Summary!B4/C9","v":41477.272727272721},{"$f":"Summary!B4/D9","v":19414.893617021276},{"$f":"Summary!$B$4/E9","v":32589.285714285717}]
["Total Annual Fuel Cost ( ₹ )",{"$f":"(B10*B8)","v":547500},{"$f":"(C10*C8)","v":3649999.9999999995},{"$f":"(D10*D8)","v":1708510.6382978724},{"$f":"(E10*E8)","v":1531696.4285714286}]
["Per km Fuel Cost",{"$f":"B11/Summary!$B$4","v":6},{"$f":"C11/Summary!$B$4","v":39.999999999999993},{"$f":"D11/Summary!$B$4","v":18.723404255319149},{"$f":"E11/Summary!$B$4","v":16.785714285714285}]
[]
["Maintenance Cost","e-Bus (AC)","Diesel-HC Bus (AC)","Diesel-LC Bus (AC)","CNG-Bus (AC)"]
["Annual Maintenance Cost (₹)",{"$f":"VLOOKUP('Buses TCO Dashboard'!$C$15,'Operational Cost'!$A$40:$E$42,2,0)","v":150000},{"$f":"VLOOKUP('Buses TCO Dashboard'!$C$15,'Operational Cost'!$A$40:$E$42,3,0)","v":500000},{"$f":"VLOOKUP('Buses TCO Dashboard'!$C$15,'Operational Cost'!$A$40:$E$42,4,0)","v":300000},{"$f":"VLOOKUP('Buses TCO Dashboard'!$C$15,'Operational Cost'!$A$40:$E$42,5,0)","v":324000}]
{"$rows_left_out":33}
{"sheet":"Financing","index":6,"n_rows":24,"n_cols":5,"rows_kept":24,"cut":false,"hidden":true,"merged":[[20,0,20,4],[25,0,25,4]]}
["Vehicle Cost","e-Bus","Diesel - Bus (HC)","Diesel - Bus (LC)","CNG - Bus"]
["Total Cost of Bus (₹)",{"$f":"'Buses TCO Dashboard'!C20-'Buses TCO Dashboard'!C23","v":10000000},{"$f":"'Buses TCO Dashboard'!D20","v":8800000},{"$f":"'Buses TCO Dashboard'!E20","v":5807000},{"$f":"'Buses TCO Dashboard'!F20","v":5600000}]
["Share of Operator (%)",{"$f":"100%-B6","v":0.8},{"$f":"100%-C6","v":0.8},0.8,0.8]
["Share of Operator (₹)",{"$f":"B3*B2","v":8000000},{"$f":"C3*C2","v":7040000},{"$f":"D3*D2","v":4645600},{"$f":"E3*E2","v":4480000}]
["Processing  Fees",{"$f":"IF(B8=0,0,IF(B4*0.5%>500,B4*0.5%,500))","v":40000},{"$f":"IF(C8=0,0,IF(C4*0.5%>500,C4*0.5%,500))","v":35200},23228,22400]
["Equity %",{"$f":"'Buses TCO Dashboard'!C31","v":0.2},{"$f":"'Buses TCO Dashboard'!D31","v":0.2},{"$f":"'Buses TCO Dashboard'!E31","v":0.2},{"$f":"'Buses TCO Dashboard'!F31","v":0.2}]
["Equity (₹)",{"$f":"(B6*B2)","v":2000000},{"$f":"(C6*C2)","v":1760000},{"$f":"(D6*D2)","v":1161400},{"$f":"(E6*E2)","v":1120000}]
["Loan amount (₹)",{"$f":"B4","v":8000000},{"$f":"C4","v":7040000},{"$f":"D4","v":4645600},{"$f":"E4","v":4480000}]
["Interest rate (%)",{"$f":"'Buses TCO Dashboard'!C30","v":0.11},{"$f":"'Buses TCO Dashboard'!D30","v":0.08},{"$f":"'Buses TCO Dashboard'!E30","v":0.08},{"$f":"'Buses TCO Dashboard'!F30","v":0.08}]
["Term of payment (yrs)",{"$f":"'Buses TCO Dashboard'!C29","v":7},{"$f":"'Buses TCO Dashboard'!D29","v":7},{"$f":"'Buses TCO Dashboard'!E29","v":7},{"$f":"'Buses TCO Dashboard'!F29","v":7}]
["No of EMI (Yearly)",{"$f":"B10*12","v":84},{"$f":"C10*12","v":84},84,84]
["Monthly EMI Loan (Rs.)",{"$f":"((PMT(B9/12,B10*12,-B8))+(B5/B11))","v":137455.68195538054},{"$f":"((PMT(C9/12,C10*12,-C8))+(C5/C11))","v":110145.99701384119},72683.841438565432,70092.907190626211]
["Total interest paid",{"$f":"(B12*B10*12)-B8","v":3546277.2842519656},{"$f":"(C12*C10*12)-C8","v":2212263.749162659},1459842.6808394967,1407804.2040126016]
["Yearly Interest Paid",{"$f":"B13/B10","v":506611.04060742364},{"$f":"C13/C10","v":316037.67845180846},{"$f":"D13/D10","v":208548.95440564238},{"$f":"E13/E10","v":201114.88628751453}]
["EMI per KM (Rs.)",{"$f":"B14/Summary!B4","v":5.5519018148758752},{"$f":"C14/Summary!B4","v":3.4634266131705038},{"$f":"D14/Summary!B4","v":2.2854679934864919},{"$f":"E14/Summary!B4","v":2.2039987538357755}]
{"$rows_left_out":10}
{"sheet":"TCO_1","index":7,"n_rows":40,"n_cols":13,"rows_kept":40,"cut":false,"hidden":true,"merged":[]}
["Parameter","Unit","e-Bus (AC)","Diesel-HC Bus (AC)","Diesel-LC Bus (AC)","CNG-Bus (AC)"]
["Discount rate value","-",{"$f":"Summary!B10","v":0.1},{"$f":"Summary!C10","v":0.1},{"$f":"Summary!D10","v":0.1},{"$f":"Summary!E10","v":0.1}]
["Resale rate value","-",{"$f":"Summary!B11","v":0.2},{"$f":"Summary!C11","v":0.1},{"$f":"Summary!D11","v":0.1},{"$f":"Summary!E11","v":0.1}]
["Capital recovery factor (CRF)_N","-",{"$f":"C2*(1+C2)^Summary!B3","v":0.2593742460100002},{"$f":"D2*(1+D2)^Summary!B3","v":0.2593742460100002},{"$f":"E2*(1+E2)^Summary!B3","v":0.2593742460100002},{"$f":"F2*(1+F2)^Summary!B3","v":0.2593742460100002}]
["Capital recovery factor (CRF)_D","-",{"$f":"((1+C2)^Summary!B3)-1","v":1.5937424601000019},{"$f":"(1+D2)^Summary!B3-1","v":1.5937424601000019},{"$f":"(1+E2)^Summary!B3-1","v":1.5937424601000019},{"$f":"(1+F2)^Summary!B3-1","v":1.5937424601000019}]
["CRF","-",{"$f":"C4/C5","v":0.16274539488251155},{"$f":"D4/D5","v":0.16274539488251155},{"$f":"E4/E5","v":0.16274539488251155},{"$f":"F4/F5","v":0.16274539488251155}]
["Present value factor (PVF)","-",{"$f":"1/(1+C2)^10","v":0.38554328942953148},{"$f":"1/(1+D2)^Summary!B3","v":0.38554328942953148},{"$f":"1/(1+E2)^Summary!B3","v":0.38554328942953148},{"$f":"1/(1+F2)^Summary!B3","v":0.38554328942953148}]
["Residual value (RV)","₹",{"$f":"Summary!B14*C3","v":3709255.4568503932},{"$f":"Summary!C14*D3","v":1284357.674916266},{"$f":"Summary!D14*E3","v":901910.56808394985},{"$f":"Summary!E14*F3","v":875820.42040126026}]
["Annual  Travel Distance","km",{"$f":"Summary!$B$4","v":91250},{"$f":"Summary!$B$4","v":91250},{"$f":"Summary!$B$4","v":91250},{"$f":"Summary!$B$4","v":91250}]
["Capex component","₹",{"$f":"((Summary!B19-(C8*C7))*C6)","v":1971855.5474533937},{"$f":"(Summary!C19-(D8*D7))*D6","v":2009645.4402633153},{"$f":"(Summary!D19-(E8*E7))*E6","v":1411227.1807721895},{"$f":"(Summary!E19-(F8*F7))*F6","v":1370403.7035194593}]
["TCO","₹/km",{"$f":"(C10+L22)/C9","v":33.046914149071881},{"$f":"(D10+L23)/D9","v":54.446624675727328},{"$f":"(E10+L24)/E9","v":33.468314884995642},{"$f":"(F10+L25)/F9","v":31.991918239629442}]
[]
["Opex / year"]
["Vehicle type","Unit",1,{"$f":"C14+1","v":2},3,4,5,6,7,8,9,10,"Total"]
["e-Bus (AC)","₹",{"$f":"Summary!$B$27/(1+$C$2)^C14","v":1544121.4545454546},{"$f":"Summary!$B$27/(1+$C$2)^D14","v":1403746.7768595039},{"$f":"Summary!$B$27/(1+$C$2)^E14","v":1276133.4335086397},{"$f":"Summary!$B$27/(1+$C$2)^F14","v":1160121.3031896725},{"$f":"Summary!$B$27/(1+$C$2)^G14","v":1054655.7301724295},{"$f":"Summary!$B$27/(1+$C$2)^H14","v":958777.93652039033},{"$f":"Summary!$B$27/(1+$C$2)^I14","v":871616.30592762749},{"$f":"Summary!$B$27/(1+$C$2)^J14","v":792378.45993420691},{"$f":"Summary!$B$27/(1+$C$2)^K14","v":720344.05448564258},{"$f":"Summary!$B$27/(1+$C$2)^L14","v":654858.23135058407},{"$f":"SUM(C15:L15)/Summary!B3","v":1043675.3686494153}]
{"$rows_left_out":26}
{"sheet":"Plots","index":8,"n_rows":0,"n_cols":0,"rows_kept":0,"cut":false,"hidden":true,"merged":[]}

{"sheet":"References","index":9,"n_rows":33,"n_cols":13,"rows_kept":33,"cut":false,"hidden":true,"merged":[]}
[]
[null,"Assumption","Source"]
[null,"Life of Vehicle","Assumed"]
[null,"Annual driving distance","Assumed"]
[null,"Total distance travelled","Assumed"]
[null,"LIB cost","https://bnef.turtl.co/story/evo2018?teaser=true ",null,null,null,null,"BNEF EV Outlook 2018 ($200/kWh)"]
[null,"Discount rate","Assumed"]
[null,"Resale value","Assumed"]
[null,"Purchase cost (e-4W) + Tax + Insurance","https://www.zigwheels.com/newcars/Mahindra/e-verito/on-road-price-delhi"]
[null,"Purchase cost (CNG-4W) + Tax + Insurance","https://www.zigwheels.com/newcars/Ford/figo-aspire/on-road-price-delhi",null,null,null,null,null,null,"(Refer Trend Plus CNG)"]
[null,"Purchase cost (Petrol-4W) + Tax + Insurance","https://www.zigwheels.com/newcars/Ford/figo-aspire/on-road-price-delhi"]
[null,"Purchase cost (Diesel-4W) + Tax + Insurance","https://www.zigwheels.com/newcars/Mahindra/Verito/on-road-price-delhi"]
[null,"Fuel cost (e-4W)","http://transport.delhi.gov.in/sites/default/files/All-PDF/Electric%20Policy%202018.pdf"]
[null,"Fuel cost (CNG-4W)","To be added by Parveen"]
[null,"Fuel cost (Petrol-4W)","https://www.iocl.com/Product_PreviousPrice/PetrolPreviousPriceDynamic.aspx"]
{"$rows_left_out":18}